{"text_format":"1","workbook":"xlsx","n_sheets":6,"sheets":["TableauMarque","5Quilles","5Sets","Instructions","WarmUp","Tableau de Bord"],"not_rendered":{"charts":0,"images":62,"macros":1,"external_links":1,"defined_names":26,"comments":3,"pivot_tables":0},"unopened":[],"bounds":{"document_bytes":16777216,"sheet_cells":100000,"rows_first":2000,"rows_last":500,"rows_between":2000,"halvings":0,"cell_chars":16384,"cell_head_chars":4096},"cells_cut":0,"cells_raw":0,"read":"whole","date_system":"1900"}

{"sheet":"TableauMarque","index":0,"n_rows":69,"n_cols":44,"rows_kept":69,"cut":false,"hidden":false,"merged":[[57,1,57,2],[58,1,58,3],[59,1,59,3],[33,2,33,4],[5,6,5,16],[5,23,5,33],[0,0,4,4],[0,35,4,39],[23,4,26,9],[23,30,26,35],[9,17,10,22],[25,20,26,22],[25,23,26,29],[25,10,26,12],[25,13,26,19],[5,17,8,22],[23,0,26,3],[23,36,26,39],[23,10,24,12],[0,5,4,19],[0,20,4,34],[23,20,24,22],[33,13,33,16],[43,1,43,5],[35,13,35,16],[35,17,35,21],[35,22,35,26],[32,13,32,16],[31,18,31,21],[34,10,34,11],[36,1,36,5],[34,17,34,21],[31,34,31,35],[32,2,32,4],[46,1,46,5],[42,1,42,5],[23,23,24,29],[6,1,20,16],[6,23,20,38],[11,17,15,22],[16,17,21,22],[21,7,22,10],[21,29,22,32],[22,18,22,21],[23,13,24,19],[21,11,22,12],[21,27,22,28],[21,5,22,6],[21,33,22,34],[45,1,45,5],[34,13,34,16],[30,34,30,35],[32,34,32,35],[32,22,32,26],[33,22,33,26],[33,17,33,21],[32,17,32,21],[34,22,34,26],[37,11,41,15],[42,11,46,15],[47,11,51,15],[52,11,56,15],[57,11,61,15],[52,31,56,35],[37,1,37,5],[34,1,34,5],[41,1,41,5],[35,1,35,5],[38,1,38,5],[39,1,39,5],[40,1,40,5],[55,1,55,5],[52,1,52,5],[53,1,53,5],[54,1,54,5],[47,31,51,35],[47,1,47,5],[48,1,48,5],[49,1,49,5],[44,1,44,5],[50,1,50,5],[51,1,51,5],[60,1,60,3],[62,21,66,25],[57,31,61,35],[37,26,41,30],[42,26,46,30],[47,26,51,30],[52,26,56,30],[57,26,61,30],[62,26,66,30],[37,21,41,25],[42,21,46,25],[47,21,51,25],[52,21,56,25],[57,21,61,25],[62,31,66,35],[37,31,41,35],[42,31,46,35],[62,11,66,15],[37,16,41,20],[42,16,46,20],[47,16,51,20],[52,16,56,20],[57,16,61,20],[62,16,66,20]]}
[{"$f":"A6","v":"D"},{"$f":"VLOOKUP(C1,B32:H51,7)","v":{"$error":"#N/A"}},{"$error":"#N/A"},{"$error":"#N/A"},{"$error":"#N/A"},"HORN",null,null,null,null,null,null,null,null,null,null,null,null,null,null,"SANCHEZ",null,null,null,null,null,null,null,null,null,null,null,null,null,null,{"$f":"AN6","v":"E"},null,null,null,null,null,null,{"$f":"F1","v":"HORN"},{"$f":"U1","v":"SANCHEZ"}]
[{"$f":"VLOOKUP(B2,A33:G52,7)","v":{"$error":"#N/A"}},{"$error":"#N/A"},{"$error":"#N/A"},{"$error":"#N/A"},{"$error":"#N/A"},null,null,null,null,null,null,null,null,null,null,null,null,null,null,null,null,null,null,null,null,null,null,null,null,null,null,null,null,null,null,null,null,null,null,null,null,1]
[{"$f":"VLOOKUP(B3,A34:G53,7)","v":{"$error":"#N/A"}},{"$error":"#N/A"},{"$error":"#N/A"},{"$error":"#N/A"},{"$error":"#N/A"},null,null,null,null,null,null,null,null,null,null,null,null,null,null,null,null,null,null,null,null,null,null,null,null,null,null,null,null,null,null,null,null,null,null,null,null,2]
[{"$f":"VLOOKUP(B4,A35:G54,7)","v":{"$error":"#N/A"}},{"$error":"#N/A"},{"$error":"#N/A"},{"$error":"#N/A"},{"$error":"#N/A"},null,null,null,null,null,null,null,null,null,null,null,null,null,null,null,null,null,null,null,null,null,null,null,null,null,null,null,null,null,null,null,null,null,null,null,null,3]
[{"$f":"VLOOKUP(B5,A36:G55,7)","v":{"$error":"#N/A"}},{"$error":"#N/A"},{"$error":"#N/A"},{"$error":"#N/A"},{"$error":"#N/A"},null,null,null,null,null,null,null,null,null,null,null,null,null,null,null,null,null,null,null,null,null,null,null,null,null,null,null,null,null,null,null,null,null,null,null,null,4]
[{"$f":"VLOOKUP(F1,B37:G56,6,FALSE)","v":"D"},null,null,null,{"$f":"VLOOKUP(A6,I38:J67,2,0)","v":"AA38"},null,{"$f":"REPT(\"   \"&C34&\"   \",O29)","v":""},null,null,null,null,null,null,null,null,null,null,null,null,null,null,null,null,{"$f":"REPT(\"   \"&C34&\"   \",Z29)","v":""},null,null,null,null,null,null,null,null,null,null,null,{"$f":"VLOOKUP(AN6,I38:J67,2,0)","v":"AF38"},null,null,null,{"$f":"VLOOKUP(U1,B37:G56,6,FALSE)","v":"E"},null,5]
[{"$f":"IF(H35>0,H35,VLOOKUP(F1,$B$37:$H$56,7,FALSE))","v":40},0,null,null,null,null,null,null,null,null,null,null,null,null,null,null,null,null,null,null,null,null,null,0,null,null,null,null,null,null,null,null,null,null,null,null,null,null,null,{"$f":"IF(H35>0,H35,VLOOKUP(U1,$B$37:$H$56,7,FALSE))","v":40},null,6]
[null,null,null,null,null,null,null,null,null,null,null,null,null,null,null,null,null,null,null,null,null,null,null,null,null,null,null,null,null,null,null,null,null,null,null,null,null,null,null,null,null,7]
[null,null,null,null,null,null,null,null,null,null,null,null,null,null,null,null,null,null,null,null,null,null,null,null,null,null,null,null,null,null,null,null,null,null,null,null,null,null,null,null,null,8]
[null,null,null,null,null,null,null,null,null,null,null,null,null,null,null,null,null,null,null,null,null,null,null,null,null,null,null,null,null,null,null,null,null,null,null,null,null,null,null,null,null,9]
[null,null,null,null,null,null,null,null,null,null,null,null,null,null,null,null,null,null,null,null,null,null,null,null,null,null,null,null,null,null,null,null,null,null,null,null,null,null,null,null,null,10]
[null,null,null,null,null,null,null,null,null,null,null,null,null,null,null,null,null,0,null,null,null,null,null,null,null,null,null,null,null,null,null,null,null,null,null,null,null,null,null,null,null,11]
[null,null,null,null,null,null,null,null,null,null,null,null,null,null,null,null,null,null,null,null,null,null,null,null,null,null,null,null,null,null,null,null,null,null,null,null,null,null,null,null,null,12]
[null,null,null,null,null,null,null,null,null,null,null,null,null,null,null,null,null,null,null,null,null,null,null,null,null,null,null,null,null,null,null,null,null,null,null,null,null,null,null,null,null,13]
[null,null,null,null,null,null,null,null,null,null,null,null,null,null,null,null,null,null,null,null,null,null,null,null,null,null,null,null,null,null,null,null,null,null,null,null,null,null,null,null,null,14]
[null,null,null,null,null,null,null,null,null,null,null,null,null,null,null,null,null,null,null,null,null,null,null,null,null,null,null,null,null,null,null,null,null,null,null,null,null,null,null,null,null,15]
[null,null,null,null,null,null,null,null,null,null,null,null,null,null,null,null,null,null,null,null,null,null,null,null,null,null,null,null,null,null,null,null,null,null,null,null,null,null,null,null,null,16]
[null,null,null,null,null,null,null,null,null,null,null,null,null,null,null,null,null,null,null,null,null,null,null,null,null,null,null,null,null,null,null,null,null,null,null,null,null,null,null,null,null,17]
[null,null,null,null,null,null,null,null,null,null,null,null,null,null,null,null,null,null,null,null,null,null,null,null,null,null,null,null,null,null,null,null,null,null,null,null,null,null,null,null,null,18]
[null,null,null,null,null,null,null,null,null,null,null,null,null,null,null,null,null,null,null,null,null,null,null,null,null,null,null,null,null,null,null,null,null,null,null,null,null,null,null,null,null,19]
[null,null,null,null,null,null,null,null,null,null,null,null,null,null,null,null,null,null,null,null,null,null,null,null,null,null,null,null,null,null,null,null,null,null,null,null,null,null,null,null,null,20]
[null,null,null,null,null,{"$f":"IF(A7-A23<=3,A7-A23,\"\")","v":""},null,{"$f":"IF($H$35>0,\"\",(B7+E24)/L22)","v":""},null,{"$f":"IF($H$35>0,$H$35,VLOOKUP(#REF!,$A$37:$H$56,8))","v":40},null,{"$f":"IF($H$35>0,\"\",VLOOKUP(F1,$B$37:$H$56,7,FALSE))","v":""},null,null,null,null,null,null,null,null,null,null,null,null,null,null,null,{"$f":"IF($H$35>0,\"\",VLOOKUP(U1,$B$37:$H$56,7,FALSE))","v":""},null,{"$f":"IF($H$35>0,\"\",(X7+AE24)/AB22)","v":""},null,{"$f":"IF($H$35>0,$H$35,VLOOKUP(#REF!,$A$37:$H$56,8))","v":40},null,{"$f":"IF(AN7-AN23<=3,AN7-AN23,\"\")","v":""},null,null,null,null,null,null,null,21]
[{"$f":"B7+E24","v":0},null,null,null,null,null,null,null,null,null,null,null,null,null,null,null,null,null,{"$f":"NOW()","v":43009.414797685182},null,null,null,null,null,null,null,null,null,null,null,null,null,null,null,null,null,null,null,null,{"$f":"X7+AE24","v":0},null,22]
[{"$f":"IF(E24<>\"\",$A$34,\"\")","v":"\u0098"},null,null,null,0,null,null,null,null,null,"HR:",null,null,{"$f":"G35","v":0},null,null,null,null,null,null,"HR:",null,null,{"$f":"$AH$35","v":0},null,null,null,null,null,null,null,null,null,null,null,null,{"$f":"IF(AE24<>\"\",$A$34,\"\")","v":""},null,null,null,null,23]
[null,null,null,null,null,null,null,null,null,null,null,null,null,null,null,null,null,null,null,null,null,null,null,null,null,null,null,null,null,null,null,null,null,null,null,null,null,null,null,null,null,24]
[null,null,null,null,null,null,null,null,null,null,"AVG:",null,null,{"$f":"IF(B7=0,\"\",B7/R12)","v":""},null,null,null,null,null,null,"AVG:",null,null,{"$f":"IF(X7=0,\"\",X7/R12)","v":""},null,null,null,null,null,null,null,null,null,null,null,null,null,null,null,null,null,25]
[null,null,null,null,null,null,null,null,null,null,null,null,null,null,null,null,null,null,null,null,null,null,null,null,null,null,null,null,null,null,null,null,null,null,null,null,null,null,null,null,null,26]
[40,{"$f":"A28-1","v":39},{"$f":"B28-1","v":38},37,36,35,34,33,32,31,30,29,28,27,26,25,24,23,22,21,20,19,18,17,16,15,14,13,12,11,10,9,8,7,6,5,4,3,2,1,null,27]
[null,null,null,null,null,"Warm-Up",null,null,"AD","DR","RE","DEL",null,null,null,null,null,null,null,null,null,null,null,null,null,null,null,null,"TO","WU","P","RS","END",null,null,null,null,null,null,null,null,28]
[null,null,null,null,null,null,null,null,"VL","LA","NS","MA",null,null,"TO",null,null,null,null,null,null,null,null,null,null,"TO",null,null,null,"T1","T2","T3","T4",null,null,null,null,null,null,null,null,29]
[null,null,null,3,null,null,null,null,null,null,null,null,null,null,null,null,null,null,null,null,null,null,null,null,null,null,null,null,null,null,null,null,null,null,null,null,null,null,null,null,null,30]
[null,null,null,null,null,null,null,null,null,null,null,null,null,null,null,null,null,null,{"$f":"NOW()","v":"2017-10-01T09:57:18.520"},null,null,null,null,null,null,null,false,null,null,null,null,null,null,null,null,null,null,null,null,null,null,31]
[{"$f":"MID(C33,1,1)","v":"A"},null,"Affichage",null,null,"Nbr.",null,null,null,null,null,null,null,null,null,null,null,null,null,null,null,null,null,null,null,null,null,null,null,118,null,null,null,null,null,null,null,null,null,null,null,32]
["\u0098",null,"██████",null,null,null,"HR","Pts.",null,null,null,null,null,null,null,null,null,null,null,null,null,null,null,null,null,null,null,null,null,null,null,98,null,"HR",null,null,null,null,null,null,null,33]
[0,null,null,null,null,null,{"$f":"IF(R12=0,0,IF(E24>G35,E24,G35))","v":0},40,null,null,null,null,null,null,null,null,null,null,null,null,null,null,null,null,null,null,null,null,null,null,null,null,null,{"$f":"IF(R12=0,0,IF(X24>AE24,X24,AE24))","v":0},null,null,null,null,null,0,null,34]
["Nr.","Joueurs / Players",null,null,null,null,null,"Pts.",null,null,null,null,null,null,null,null,null,null,null,null,null,null,null,null,null,null,null,{"$f":"R36+W36","v":0},null,null,null,null,null,null,null,null,null,null,null,null,null,35]
[1,"RECH",null,null,null,null,"ZH",40,null,null,null,"L",null,null,null,null,"Q",null,null,null,null,"V",null,null,null,null,"AA",null,null,null,null,"AF",null,null,null,null,null,null,null,null,null,36]
[2,"CETIN",null,null,null,null,"ZH",39,"CH","L38",38,null,null,null,null,null,null,null,null,null,null,null,null,null,null,null,null,null,null,null,null,null,null,null,null,null,null,null,null,null,null,37]
[3,"BERGER",null,null,null,null,"BS",38,"B","Q38",null,null,null,null,null,null,null,null,null,null,null,null,null,null,null,null,null,null,null,null,null,null,null,null,null,null,null,null,null,0,null,38]
[4,"VALENTE",null,null,null,null,"GE",37,"NL","V38",null,null,null,null,null,null,null,null,null,null,null,null,null,null,null,null,null,null,null,null,null,null,null,null,null,null,null,null,null,null,null,39]
{"$rows_left_out":30}
{"sheet":"5Quilles","index":1,"n_rows":51,"n_cols":30,"rows_kept":51,"cut":false,"hidden":false,"merged":[[34,29,34,30],[34,0,34,1],[37,7,39,23],[30,29,31,30],[32,29,33,30],[32,0,33,1],[24,17,30,28],[26,14,28,16],[32,2,36,28],[29,29,29,30],[24,29,24,30],[25,29,25,30],[26,29,26,30],[27,29,27,30],[28,29,28,30],[50,0,51,6],[2,9,3,9],[2,10,3,10],[2,11,3,11],[2,12,3,12],[2,1,3,1],[2,2,3,2],[2,3,3,3],[2,4,3,4],[2,5,3,5],[2,6,3,6],[6,1,22,14],[2,13,3,13],[2,14,3,14],[46,0,47,6],[24,2,30,13],[2,28,3,28],[2,29,3,29],[2,16,3,16],[2,17,3,17],[2,18,3,18],[2,7,3,7],[2,8,3,8],[0,14,1,16],[42,0,43,4],[42,5,43,6],[2,15,3,15],[6,16,22,29],[2,19,3,19],[2,20,3,20],[2,21,3,21],[2,22,3,22],[2,23,3,23],[2,24,3,24],[2,25,3,25],[2,26,3,26],[2,27,3,27],[44,0,45,6],[48,0,49,6],[24,14,25,16],[30,0,31,1],[40,0,41,4],[40,5,41,6],[24,0,24,1],[25,0,25,1],[26,0,26,1],[27,0,27,1],[28,0,28,1],[29,0,29,1],[29,14,30,16]]}
[]
[]
[null,2,null,3,null,4,null,5,null,6,null,7,null,8,null,9,null,10,null,11,null,12,null,13,null,14,null,15,null,16]
[]
[]
[null,0]
[null,0,null,null,null,null,null,null,null,null,null,null,null,null,null,"FBM",0]
[null,null,null,null,null,null,null,null,null,null,null,null,null,null,null,"END"]
[null,null,null,null,null,null,null,null,null,null,null,null,null,null,null,"P"]
[]
[]
[]
[]
[]
[]
[]
[]
[]
[]
[]
[]
[]
[]
[]
[null,null,"HORN",null,null,null,null,null,null,null,null,null,null,null,"Points:",null,null,"SANCHEZ"]
[]
[null,null,null,null,null,null,null,null,null,null,null,null,null,null,100]
[]
[]
[null,null,null,null,null,null,null,null,null,null,null,null,null,null,0]
[]
[null,null,null,null,null,null,null,null,null,null,null,null,null,null,null,18]
[]
[]
[]
[]
[]
[]
[0]
[]
{"$rows_left_out":12}
{"sheet":"5Sets","index":2,"n_rows":60,"n_cols":28,"rows_kept":60,"cut":false,"hidden":false,"merged":[[27,1,32,3],[27,4,32,14],[8,5,15,7],[8,9,15,11],[27,15,30,16],[1,1,6,3],[1,4,6,14],[8,1,15,3],[18,1,25,3],[3,15,6,16],[18,5,25,7],[18,9,25,11],[1,17,2,18],[31,17,32,18],[3,17,6,18],[27,17,30,18],[8,17,15,19],[40,5,40,15],[41,5,41,15],[18,17,25,19],[8,13,15,15],[18,13,25,15]]}
[]
[null,{"$f":"VLOOKUP(E2,B41:C60,2,FALSE)","v":"ALB"},null,null,"BOULAZ",null,null,null,null,null,null,null,null,null,null,null,null,{"$f":"IF(C17=\"\",\"\",SUM(B9:T16)/SUM(C17:S17))","v":""}]
[]
[null,null,null,null,null,null,null,null,null,null,null,null,null,null,null,{"$f":"SUM(AB9:AB13)","v":0},null,{"$f":"IF(P4>W5/2,\"WIN\",\"\")","v":""},null,null,null,null,"Sets"]
[null,null,null,null,null,null,null,null,null,null,null,null,null,null,null,null,null,null,null,null,null,null,5]
[null,null,null,null,null,null,null,null,null,null,null,null,null,null,null,null,null,null,null,null,null,null,"Reprises"]
[null,null,null,null,null,null,null,null,null,null,null,null,null,null,null,null,null,null,null,null,null,null,5]
[null,null,"ò",null,null,null,null,null,null,null,"ò",null,null,null,null,null,null,null,"ò",null,null,null,"Points"]
[null,null,null,null,null,null,null,null,null,null,null,null,null,null,null,null,null,null,null,null,null,null,20,null,null,{"$f":"IF(B9>=$W$9,1,0)","v":0},{"$f":"IF(AND(C18=W7,B9>B19),1,0)","v":0},{"$f":"IF(SUM(Z9:AA9)>1,1,SUM(Z9:AA9))","v":0}]
[null,null,null,null,null,null,null,null,null,null,null,null,null,null,null,null,null,null,null,null,null,"5 Billes","5 Quilles",null,null,{"$f":"IF(F9>=$W$9,1,0)","v":0},{"$f":"IF(AND(G17=W7,F9>F19),1,0)","v":0},0]
[null,null,null,null,null,null,null,null,null,null,null,null,null,null,null,null,null,null,null,null,null,null,2,null,null,{"$f":"IF(J9>=$W$9,1,0)","v":0},{"$f":"IF(AND(K18=W7,J9>J19),1,0)","v":0},0]
[null,null,null,null,null,null,null,null,null,null,null,null,null,null,null,null,null,null,null,null,null,3,3,null,null,{"$f":"IF(N9>=$W$9,1,0)","v":0},{"$f":"IF(AND(O17=W7,N9>N19),1,0)","v":0},0]
[null,null,null,null,null,null,null,null,null,null,null,null,null,null,null,null,null,null,null,null,null,null,4,null,null,{"$f":"IF(R9>=$W$9,1,0)","v":0},{"$f":"IF(AND(S18=W7,R9>R19),1,0)","v":0},{"$f":"IF(SUM(Z13:AA13)>1,1,SUM(Z13:AA13))","v":0}]
[null,null,null,null,null,null,null,null,null,null,null,null,null,null,null,null,null,null,null,null,null,5,5,null,null,"J"]
[null,null,null,null,null,null,null,null,null,null,null,null,null,null,null,null,null,null,null,null,null,6,6,null,null,"L"]
[null,null,null,null,null,null,null,null,null,null,null,null,null,null,null,null,null,null,null,null,null,7,7]
[null,null,null,null,null,null,null,null,null,null,null,null,null,null,null,null,null,null,null,null,null,8,8]
[null,null,null,null,null,null,null,null,null,null,null,null,null,null,null,null,null,null,null,null,null,9,9]
[null,null,null,null,null,null,null,null,null,null,null,null,null,null,null,null,null,null,null,null,null,10,10,null,null,{"$f":"IF(B19>=$W$9,1,0)","v":0},{"$f":"IF(AND(C18=$W$7,B19>B9),1,0)","v":0},{"$f":"IF(SUM(Z19:AA19)>1,1,SUM(Z19:AA19))","v":0}]
[null,null,null,null,null,null,null,null,null,null,null,null,null,null,null,null,null,null,null,null,null,11,11,null,null,{"$f":"IF(F19>=$W$9,1,0)","v":0},{"$f":"IF(AND(G17=$W$7,F19>F9),1,0)","v":0},0]
[null,null,null,null,null,null,null,null,null,null,null,null,null,null,null,null,null,null,null,null,null,12,12,null,null,{"$f":"IF(J19>=$W$9,1,0)","v":0},{"$f":"IF(AND(K18=$W$7,J19>J9),1,0)","v":0},{"$f":"IF(SUM(Z21:AA21)>1,1,SUM(Z21:AA21))","v":0}]
[null,null,null,null,null,null,null,null,null,null,null,null,null,null,null,null,null,null,null,null,null,13,13,null,null,{"$f":"IF(N19>=$W$9,1,0)","v":0},{"$f":"IF(AND(O17=$W$7,N19>N9),1,0)","v":0},{"$f":"IF(SUM(Z22:AA22)>1,1,SUM(Z22:AA22))","v":0}]
[null,null,null,null,null,null,null,null,null,null,null,null,null,null,null,null,null,null,null,null,null,null,14,null,null,{"$f":"IF(R19>=$W$9,1,0)","v":0},{"$f":"IF(AND(S18=$W$7,R19>R9),1,0)","v":0},0]
[null,null,null,null,null,null,null,null,null,null,null,null,null,null,null,null,null,null,null,null,null,null,15]
[null,null,null,null,null,null,null,null,null,null,null,null,null,null,null,null,null,null,null,null,null,null,16]
[]
[null,null,null,null,null,null,"ñ",null,null,null,null,null,null,null,"ñ",null,null,null,null,{"$f":"SUM(V9:W9)","v":20}]
[null,{"$f":"VLOOKUP(E28,B41:C60,2,FALSE)","v":"ZH"},null,null,"CETIN",null,null,null,null,null,null,null,null,null,null,{"$f":"SUM(AB19:AB23)","v":0},null,{"$f":"IF(P28>W5/2,\"WIN\",\"\")","v":""}]
[]
[]
[]
[null,null,null,null,null,null,null,null,null,null,null,null,null,null,null,11,null,{"$f":"IF(C18=\"\",\"\",SUM(B19:T26)/SUM(C18:S18))","v":""},null,null,8]
[]
[]
[]
[]
[]
[]
[]
[]
{"$rows_left_out":21}
{"sheet":"Instructions","index":3,"n_rows":48,"n_cols":43,"rows_kept":48,"cut":false,"hidden":false,"merged":[]}
[]
["NE JAMAIS modifier une cellule contenant une formule !",null,null,"NIE ein Feld mit einer Formel verändern !",null,null,null,null,null,null,null,null,null,null,null,null,null,null,null,null,null,null,null,null,null,null,null,null,null,null,null,null,null,null,null,null,null,null,null,null,null,null,"Bild auf den Monitor abstimmen (Ev. korrigieren je nach Monitor)"]
["Des questions?","079 675 81 53 (Rolf ALBERT)",null,"Noch Fragen?","079 675 81 53 (Rolf ALBERT)",null,null,null,null,null,null,null,null,null,null,null,null,null,null,null,null,null,null,null,null,null,null,null,null,null,null,null,null,null,null,null,null,null,null,null,null,null,"Zur Hauptanzeige zurück (TableauMarque)"]
["Commandes",null,null,"Bedienung"]
[null,"Plein écran (Ajuster éventuellement avec Zoom)",null,null,"Volles Bild ( Eventuel mit Zoom anpassen)"]
[null,"Ecran normal",null,null,"Normales Bild"]
[null,"Nouvelle partie (Remet tout à 0)",null,null,"Neues Spiel (Stellt alles auf 0 zurück!)"]
["Format d'écran","Sur base 1920×1080 - 16:9 (Sinon adapter…)",null,"Bildformat","Auf 1920×1080 Basis - 16:9 (Sonst anpassen...)"]
["idéale",null,null,"ideal"]
[null,"ATTENTION! Etre dans la bonne cellule pour ces boutons !",null,null,"VORSICHT! Im richtigen Feld sein für diese Knöpfe !"]
[]
[null,"Augmenter de 1 (Corrections...)",null,"FELD !","Um 1 erhöhen (Korrektionen...)",null,null,null,null,null,null,null,null,null,null,null,null,3]
[null,"Les deux fonctionnent dans toute cellule active !",null,null,"Beide funktionnieren in jedem aktiven Feld !"]
[null,"Diminuer de 1 (Corrections...) et décompter les TIME OUT",null,"FELD !","Um 1 runtergehen (Korrektionen...) und TIME OUT runterzählen"]
[null,"Ajouter 1 point au joueur respectif",null,null,"Dem Spieler 1 Punkt hinzu fügen (Spielerbetreffend)"]
["                     ","Ajouter la série aux points du joueur respectif (Même 0 points !)",null,null,"Die Serie den Punkten zugeben. Spielerbetreffend (Auch 0 Punkte !)"]
[null,"et passer à l'autre joueur",null,null,"und zum anderen Spieler wechseln"]
[null,"Remettre la case active à 0",null,null,"Aktive Zelle auf 0 stellen"]
[null,"3 ou 5 minutes d'échauffement (Warm-Up)",null,null,"3 oder 5 Minuten Einspielzeit (Warm-Up)"]
[null,"Inverser les joueurs",null,null,"Spielanfänger wechseln"]
[null,"Accéder au contrôle pour le secrétaire (Aller-Revenir)",null,null,"Zur Kontrolle für den Secretär (Hin-Zurück)"]
[null,"Limité à 50 reprises",null,null,"Limit 50 Aufnahmen"]
[null,"Retour au tableau principal (TableauMarque)",null,null,"Zur Hauptanzeige zurück (TableauMarque)",null,null,null,null,null,null,null,null,null,null,null,null,null,null,null,null,null,null,null,null,null,null,null,null,null,0]
[]
[null,"Change en 2 ou 3 décimales selon \"Jeux de série\" ou 3 Bandes",null,null,"Wechselt auf 2 oder 3 Dezimale je nach Serie oder 3 Band"]
[]
[]
["Biathlon","Aller aux 5 Quilles ( En soi ou le Biathlon)",null,"Biathlon","Zu den 5 Kegeln gehen (Für sich oder das Biathlon)"]
[]
[]
[100,"Adapter la fenêtre selon écran (Si possible 1920×1080)",null,null,"Fenster dem Monitor anpassen (Wenn möglich 1920×1080)"]
[]
[]
["Affichages","(Cliquer dessus)",null,"Anzeigen","(Drauf klicken)"]
["TO","TIME OUT"]
["WU","WARM UP"]
["P","PAUSE"]
["RS","REPRISE SILENCE",null,null,"SPIEL GEHT WEITER RUHE"]
["END","GAME OVER"]
["AD","AVANT-DERNIERE",null,"VL","VORLETZTE AUFNAHME"]
{"$rows_left_out":9}
{"sheet":"WarmUp","index":4,"n_rows":4,"n_cols":2,"rows_kept":4,"cut":false,"hidden":false,"merged":[[2,2,2,3],[2,4,2,5],[3,1,6,15]]}
[40]
[]
[]
[null,"00:00:00"]

{"sheet":"Tableau de Bord","index":5,"n_rows":13,"n_cols":41,"rows_kept":13,"cut":false,"hidden":false,"merged":[[0,0,0,39],[11,13,11,26],[12,13,12,26],[13,13,13,26],[14,13,14,26],[7,2,7,4],[7,13,7,16],[7,17,7,21],[7,22,7,26],[8,1,8,5],[8,10,8,11],[8,13,8,16],[8,17,8,21],[8,22,8,26],[5,18,5,21],[5,34,5,35],[4,34,4,35],[18,13,18,26],[19,13,19,26],[6,2,6,4],[6,13,6,16],[6,17,6,21],[6,22,6,26],[6,34,6,35],[15,13,15,26],[16,13,16,26],[17,13,17,26],[9,13,9,16],[9,17,9,21],[9,22,9,26]]}
["Tableau des commandes - Steuerung"]
[40,{"$f":"A2-1","v":39},{"$f":"B2-1","v":38},37,36,35,34,33,32,31,30,29,28,27,26,25,24,23,22,21,20,19,18,17,16,15,14,13,12,11,10,9,8,7,6,5,4,3,2,1]
[null,null,null,null,null,"Warm-Up",null,null,"AD","DR","RE","DEL",null,null,2,null,null,null,null,null,null,null,null,null,null,2,null,"→","TO","WU","P","RS","END"]
[null,"↑","↑",null,"↑",null,null,null,"VL","LA","NS","MA",null,"↑","TO",null,"↑",null,"↑","↓","↓",null,null,null,null,"TO",null,null,"→","T1","T2","T3","T4",null,null,"↑","↑","↑",null,"↑","↑"]
[null,null,null,3,null,null,null,null,null,null,null,null,null,null,null,null,null,null,null,null,null,null,null,null,null,null,null,null,null,null,null,null,null,"←"]
[null,null,null,null,null,null,"←",null,null,null,null,null,null,null,null,null,null,null,{"$f":"NOW()","v":"2017-10-01T09:57:18.520"},null,null,null,null,null,null,null,false,"→"]
[{"$f":"MID(C7,1,1)","v":"A"},null,"Affichage",null,null,null,null,null,null,null,null,null,null,null,null,null,null,null,null,null,null,null,null,null,null,null,null,null,null,118,null,null,null,"←"]
["\u0098","→","TIME OUT",null,null,2,"HR","Pts.",null,null,null,null,null,null,null,null,null,null,null,null,null,null,null,null,null,null,null,null,null,null,null,98,null,"HR",null,null,null,"↑"]
[0,null,null,null,null,null,4,40,null,null,null,null,null,null,null,null,null,null,null,null,null,null,null,null,null,null,null,null,null,null,null,null,null,3]
[]
[]
[null,null,null,null,null,null,null,null,null,null,null,null,null,"Le mieux est de les essayer !"]
[null,null,null,null,null,null,null,null,null,null,null,null,null,"Das Beste ist diese Befehle auszuprobieren !"]